Id_Instance,Instance,Instance_Encoding,Instance_Original,Instance_Source,Stimulus,Id_Concept,Concept_Description,QID,Id_Community,Community_Name,Community_Bounding_Box,Geonames_Id,Year_Publication,Year_Survey,Informant_Lang,Id_Type,Type_Name,Type_Kind,Type_Lang,Source_Typing,POS,Affix,Gender,Id_Base_Type,Base_Type_Name,Base_Type_Lang,Base_Type_Unsure
G104_v6_192,"ʧɑlˈeː dɑ purmˈen",2,"ćαlḗ dα purmén",AIS#1192#2#5#Ems-Domat,"la cantina da latte, da formaggio ",C481_v6_192,"RAUM ZUM LAGERN VON MILCH UND KÄSE, SEPARATES HÄUSCHEN,UNTERM DACH SCHLAFEN HIRTEN UND ZUSENNEN",,A60127_v8_192,Domat/Ems,"POLYGON((9.40448760986328 46.8009719848633,9.49982357025146 46.8009719848633,9.49982357025146 46.8501815795899,9.40448760986328 46.8501815795899,9.40448760986328 46.8009719848633))",7285659,1928-1940,,rom,L2488_v5_192,"tschaler da purment",L,roa,VA,sub,,,80,cellārium,lat,0
G104_v6_192,"ʧɑlˈeː dɑ purmˈen",2,"ćαlḗ dα purmén",AIS#1192#2#5#Ems-Domat,"la cantina da latte, da formaggio ",C481_v6_192,"RAUM ZUM LAGERN VON MILCH UND KÄSE, SEPARATES HÄUSCHEN,UNTERM DACH SCHLAFEN HIRTEN UND ZUSENNEN",,A60127_v8_192,Domat/Ems,"POLYGON((9.40448760986328 46.8009719848633,9.49982357025146 46.8009719848633,9.49982357025146 46.8501815795899,9.40448760986328 46.8501815795899,9.40448760986328 46.8009719848633))",7285659,1928-1940,,rom,L2488_v5_192,"tschaler da purment",L,roa,VA,sub,,,371,pulmentum,lat,0
G14886_v2_192,"dˈa tɑmpˈɛʃtɑ",2,"dá tαmpé̜štα",AIS#372#1#5#Ems-Domat,"grandinare ; grandina 3",C2033_v3_192,HAGELN,,A60127_v8_192,Domat/Ems,"POLYGON((9.40448760986328 46.8009719848633,9.49982357025146 46.8009719848633,9.49982357025146 46.8501815795899,9.40448760986328 46.8501815795899,9.40448760986328 46.8009719848633))",7285659,1928-1940,,rom,L11866_v2_192,"dare tempesta",L,roa,VA,v,,,791,dare,lat,0
G14888_v2_192,"dˈa tɑmpˈɛstɑ",2,"dá tαmpé̜stα",AIS#372#1#5#Ems-Domat,"grandinare ; grandina 3",C2033_v3_192,HAGELN,,A60127_v8_192,Domat/Ems,"POLYGON((9.40448760986328 46.8009719848633,9.49982357025146 46.8009719848633,9.49982357025146 46.8501815795899,9.40448760986328 46.8501815795899,9.40448760986328 46.8009719848633))",7285659,1928-1940,,rom,L11866_v2_192,"dare tempesta",L,roa,VA,v,,,791,dare,lat,0
G15284_v2_192,"perɑ tˈoʃtɑ dɑ ʃtˈɛr̃l͉",2,"pe̤rα tọ́štα dα šté̜r̃l̩",AIS#623#1#5#Ems-Domat,"il cardo",C6834_v2_192,"NIEDRIGE, DER EBERWURZ ÄHNLICHE DISTEL",,A60127_v8_192,Domat/Ems,"POLYGON((9.40448760986328 46.8009719848633,9.49982357025146 46.8009719848633,9.49982357025146 46.8501815795899,9.40448760986328 46.8501815795899,9.40448760986328 46.8009719848633))",7285659,1928-1940,,rom,,,,,,,,,,,,
G15330_v2_192,lˈaːʀeʃ͉s͉,2,lā́ȓẹš̩s̩,AIS#570#1#5#Ems-Domat,"il larice (N)",C2231_v2_192,LÄRCHE,,A60127_v8_192,Domat/Ems,"POLYGON((9.40448760986328 46.8009719848633,9.49982357025146 46.8009719848633,9.49982357025146 46.8501815795899,9.40448760986328 46.8501815795899,9.40448760986328 46.8009719848633))",7285659,1928-1940,,rom,L17018_v1_192,larice,L,roa,VA,sub,,,,,,
G15478_v2_192,"kˈaʟɑs͉ dɑ mˈaʨs dɑd ˈalp",2,"káɫαs̩ dα <span style='position : relative'>má<span style='position: relative'>c<span style='position: absolute; font-size: 20%; top: 10%; left: calc(50% - 0.3em); font-weight: 900'><svg viewBox='0 0 100 100' style='display: inline-block; vertical-align: text-bottom'> <g transform='translate(0,-197)'> <path style='opacity:1;fill:#000000;fill-opacity:1;stroke:none;stroke-width:0.26458332' d='m 62.523311,202.6864 31.790967,-0.13364 -33.67596,93.63268 -6.533997,-1e-5 z' /> <path style='opacity:1;fill:#000000;fill-opacity:1;stroke:none;stroke-width:0.27790391' d='m 6.1724299,205.2214 c 2.8820995,-3.5226 9.4948791,-6.54795 16.1445731,-2.03301 46.526871,34.55507 33.752055,62.80626 0.935444,90.3371 C 17.826138,298.07355 9.918232,290.57481 7.1173704,287.74514 39.280556,261.75031 39.571048,235.98616 6.1724299,205.2214 Z'/> </g></svg></span></span>s</span> dαd álp",AIS#581#1#5#Ems-Domat,"il rododendro (N)",C2245_v3_192,ALPENROSE,,A60127_v8_192,Domat/Ems,"POLYGON((9.40448760986328 46.8009719848633,9.49982357025146 46.8009719848633,9.49982357025146 46.8501815795899,9.40448760986328 46.8501815795899,9.40448760986328 46.8009719848633))",7285659,1928-1940,,rom,,,,,,,,,,,,
G15480_v2_192,"kˈaʟɑs͉ dɑ mˈaːj̆t̆s dɑd ˈalp",2,"káɫαs̩ dα mā́ʸᵗs dαd álp",AIS#581#1#5#Ems-Domat,"il rododendro (N)",C2245_v3_192,ALPENROSE,,A60127_v8_192,Domat/Ems,"POLYGON((9.40448760986328 46.8009719848633,9.49982357025146 46.8009719848633,9.49982357025146 46.8501815795899,9.40448760986328 46.8501815795899,9.40448760986328 46.8009719848633))",7285659,1928-1940,,rom,,,,,,,,,,,,
G16_v3_192,"mˈidaː tˈeːʥɑs͉",2,"mídā tẹ̄́g͗́αs̩",AIS#1192a#6#5#Ems-Domat,tramutarsi,C95_v8_192,"DIE ALM WECHSELN",,A60127_v8_192,Domat/Ems,"POLYGON((9.40448760986328 46.8009719848633,9.49982357025146 46.8009719848633,9.49982357025146 46.8501815795899,9.40448760986328 46.8501815795899,9.40448760986328 46.8009719848633))",7285659,1928-1940,,rom,,,,,,,,,,,,
G1735_v5_192,"pɑɽkiɽˈaː lɑs vˈakɑs",2,"pαr̯kir̯ā́ lαs vákαś",AIS#1185#1#5#Ems-Domat,"pascolare le vacche",C1169_v8_192,"DIE KÜHE HÜTEN",,A60127_v8_192,Domat/Ems,"POLYGON((9.40448760986328 46.8009719848633,9.49982357025146 46.8009719848633,9.49982357025146 46.8501815795899,9.40448760986328 46.8501815795899,9.40448760986328 46.8009719848633))",7285659,1928-1940,,rom,L1301_v5_192,"parcirare le vacche",L,roa,VA,v,,,,,,
G17624_v2_192,"nˈɛːvlɑs͉ pɑlˈɛndɑn",2,"nḗ̜vlαs̩ pαlé̜ndαn",AIS#365#1#5#Ems-Domat,"la nebbia",C7002_v2_192,"NEBELSCHWADEN ZIEHEN DEN BERG ENTLANG",,A60127_v8_192,Domat/Ems,"POLYGON((9.40448760986328 46.8009719848633,9.49982357025146 46.8009719848633,9.49982357025146 46.8501815795899,9.40448760986328 46.8501815795899,9.40448760986328 46.8009719848633))",7285659,1928-1940,,rom,,,,,,,,,,,,
G17774_v2_192,"mˈaːʨ dɑ mˈaːl il kˈɛːw",2,"<span style=""position : relative"">mā́<span style=""position: relative"">c<span style='position: absolute; width: 1em; font-size: 20%; top: 10%; left: calc(50% - 0.3em); font-weight: 900'><svg viewBox='0 0 100 100' style='display: inline-block; vertical-align: text-bottom'> <g transform='translate(0,-197)'> <path style='opacity:1;fill:#000000;fill-opacity:1;stroke:none;stroke-width:0.26458332' d='m 62.523311,202.6864 31.790967,-0.13364 -33.67596,93.63268 -6.533997,-1e-5 z' /> <path style='opacity:1;fill:#000000;fill-opacity:1;stroke:none;stroke-width:0.27790391' d='m 6.1724299,205.2214 c 2.8820995,-3.5226 9.4948791,-6.54795 16.1445731,-2.03301 46.526871,34.55507 33.752055,62.80626 0.935444,90.3371 C 17.826138,298.07355 9.918232,290.57481 7.1173704,287.74514 39.280556,261.75031 39.571048,235.98616 6.1724299,205.2214 Z'/> </g></svg></span></span></span> dα mā́l il kḗ̜w",AIS#630#1#5#Ems-Domat,"il dente di leone (N)",C2371_v3_192,LÖWENZAHN,,A60127_v8_192,Domat/Ems,"POLYGON((9.40448760986328 46.8009719848633,9.49982357025146 46.8009719848633,9.49982357025146 46.8501815795899,9.40448760986328 46.8501815795899,9.40448760986328 46.8009719848633))",7285659,1928-1940,,rom,L17654_v1_192,"mac da mal di cheu",L,roa,VA,,,,,,,
G17776_v2_192,"léwŋgαs <span style='position : relative'><span style='position: relative'>c<span style='position: absolute; font-size: 20%; top: 10%; left: calc(50% - 0.3em); font-weight: 900'><svg viewBox='0 0 100 100' style='display: inline-block; vertical-align: text-bottom'> <g transform='translate(0,-197)'> <path style='opacity:1;fill:#000000;fill-opacity:1;stroke:none;stroke-width:0.26458332' d='m 62.523311,202.6864 31.790967,-0.13364 -33.67596,93.63268 -6.533997,-1e-5 z' /> <path style='opacity:1;fill:#000000;fill-opacity:1;stroke:none;stroke-width:0.27790391' d='m 6.1724299,205.2214 c 2.8820995,-3.5226 9.4948791,-6.54795 16.1445731,-2.03301 46.526871,34.55507 33.752055,62.80626 0.935444,90.3371 C 17.826138,298.07355 9.918232,290.57481 7.1173704,287.74514 39.280556,261.75031 39.571048,235.98616 6.1724299,205.2214 Z'/> </g></svg></span></span>ọ́ŋ</span>",3,"léwŋgαs <span style='position : relative'><span style='position: relative'>c<span style='position: absolute; font-size: 20%; top: 10%; left: calc(50% - 0.3em); font-weight: 900'><svg viewBox='0 0 100 100' style='display: inline-block; vertical-align: text-bottom'> <g transform='translate(0,-197)'> <path style='opacity:1;fill:#000000;fill-opacity:1;stroke:none;stroke-width:0.26458332' d='m 62.523311,202.6864 31.790967,-0.13364 -33.67596,93.63268 -6.533997,-1e-5 z' /> <path style='opacity:1;fill:#000000;fill-opacity:1;stroke:none;stroke-width:0.27790391' d='m 6.1724299,205.2214 c 2.8820995,-3.5226 9.4948791,-6.54795 16.1445731,-2.03301 46.526871,34.55507 33.752055,62.80626 0.935444,90.3371 C 17.826138,298.07355 9.918232,290.57481 7.1173704,287.74514 39.280556,261.75031 39.571048,235.98616 6.1724299,205.2214 Z'/> </g></svg></span></span>ọ́ŋ</span>",AIS#630#1#5#Ems-Domat,"il dente di leone (N)",C2371_v3_192,LÖWENZAHN,,A60127_v8_192,Domat/Ems,"POLYGON((9.40448760986328 46.8009719848633,9.49982357025146 46.8009719848633,9.49982357025146 46.8501815795899,9.40448760986328 46.8501815795899,9.40448760986328 46.8009719848633))",7285659,1928-1940,,rom,,,,,,,,,,,,
G1857_v3_192,"pɑnˈaʎɑ lˈuŋgɑ",2,"pαnáłα lúɳgα",AIS#1206#1#5#Ems-Domat,"la zangola (ill.)",C979_v8_192,"STOSSBUTTERFASS, AUS HOLZDAUBEN, KLEINER, AUS EINEM STÜCK GEHÖHLT",,A60127_v8_192,Domat/Ems,"POLYGON((9.40448760986328 46.8009719848633,9.49982357025146 46.8009719848633,9.49982357025146 46.8501815795899,9.40448760986328 46.8501815795899,9.40448760986328 46.8009719848633))",7285659,1928-1940,,rom,L1872_v4_192,"panaglia lunga",L,roa,VA,sub,,f,,,,
G22100_v1_192,"j ufˈon",2,"y ufọ́n",AIS#58#1#5#Ems-Domat,"un bambino",C7146_v1_192,"KIND (MENSCH, JUNG,  VOR DER PUBERTÄT)",Q7569,A60127_v8_192,Domat/Ems,"POLYGON((9.40448760986328 46.8009719848633,9.49982357025146 46.8009719848633,9.49982357025146 46.8501815795899,9.40448760986328 46.8501815795899,9.40448760986328 46.8009719848633))",7285659,1928-1940,,rom,,,,,,,,,,,,
G22224_v1_192,"ɑls͉ ʨˈoŋs͉",2,"αls̩ <span style=""position : relative""><span style=""position: relative"">c<span style='position: absolute; font-size: 20%; top: 10%; left: calc(50% - 0.3em); font-weight: 900'><svg viewBox='0 0 100 100' style='display: inline-block; vertical-align: text-bottom'> <g transform='translate(0,-197)'> <path style='opacity:1;fill:#000000;fill-opacity:1;stroke:none;stroke-width:0.26458332' d='m 62.523311,202.6864 31.790967,-0.13364 -33.67596,93.63268 -6.533997,-1e-5 z' /> <path style='opacity:1;fill:#000000;fill-opacity:1;stroke:none;stroke-width:0.27790391' d='m 6.1724299,205.2214 c 2.8820995,-3.5226 9.4948791,-6.54795 16.1445731,-2.03301 46.526871,34.55507 33.752055,62.80626 0.935444,90.3371 C 17.826138,298.07355 9.918232,290.57481 7.1173704,287.74514 39.280556,261.75031 39.571048,235.98616 6.1724299,205.2214 Z'/> </g></svg></span></span>ọ́ɳs̩</span>",AIS#1097#1#5#Ems-Domat,"il cane; i cani",C1524_v6_192,"HUND (HAUSTIER MTTELGROSS)",Q144,A60127_v8_192,Domat/Ems,"POLYGON((9.40448760986328 46.8009719848633,9.49982357025146 46.8009719848633,9.49982357025146 46.8501815795899,9.40448760986328 46.8501815795899,9.40448760986328 46.8009719848633))",7285659,1928-1940,,rom,,,,,,,,,,,,
G22974_v1_192,"mˈoːlɑ mulˈiŋ",2,"mṓlα mulíɳ",AIS#253#1#5#Ems-Domat,"la macina",C1810_v2_192,"MÜHLSTEIN (STEIN, ZUM MAHLEN, RUND)",Q670985,A60127_v8_192,Domat/Ems,"POLYGON((9.40448760986328 46.8009719848633,9.49982357025146 46.8009719848633,9.49982357025146 46.8501815795899,9.40448760986328 46.8501815795899,9.40448760986328 46.8009719848633))",7285659,1928-1940,,rom,,,,,,,,,,,,
G278_v5_192,"kɑʀgˈaː ɑ̆d ˈalp",2,"kαȓgā́ <sup>α</sup>d álp",AIS#1193#1#5#Ems-Domat,"inalpare (N)",C12_v8_192,"DIE ALM BEZIEHEN",,A60127_v8_192,Domat/Ems,"POLYGON((9.40448760986328 46.8009719848633,9.49982357025146 46.8009719848633,9.49982357025146 46.8501815795899,9.40448760986328 46.8501815795899,9.40448760986328 46.8009719848633))",7285659,1928-1940,,rom,L3929_v4_192,"caricare di alp",L,roa,VA,v,,,53,alpes,vor,0
G278_v5_192,"kɑʀgˈaː ɑ̆d ˈalp",2,"kαȓgā́ <sup>α</sup>d álp",AIS#1193#1#5#Ems-Domat,"inalpare (N)",C12_v8_192,"DIE ALM BEZIEHEN",,A60127_v8_192,Domat/Ems,"POLYGON((9.40448760986328 46.8009719848633,9.49982357025146 46.8009719848633,9.49982357025146 46.8501815795899,9.40448760986328 46.8501815795899,9.40448760986328 46.8009719848633))",7285659,1928-1940,,rom,L3929_v4_192,"caricare di alp",L,roa,VA,v,,,163,carrĭcare,lat,0
G439_v4_192,"piʒˈɛːdɑ rˈonʃɑ",2,"pižḗ̜dα rọ́nšα",AIS#1208#1#5#Ems-Domat,"il burro rancido",C159_v8_192,"BUTTER, RANZIG",,A60127_v8_192,Domat/Ems,"POLYGON((9.40448760986328 46.8009719848633,9.49982357025146 46.8009719848633,9.49982357025146 46.8501815795899,9.40448760986328 46.8501815795899,9.40448760986328 46.8009719848633))",7285659,1928-1940,,rom,L1389_v4_192,"pischada rontscha",L,roa,VA,sub,,f,131,*pisiāre,lat,0
G439_v4_192,"piʒˈɛːdɑ rˈonʃɑ",2,"pižḗ̜dα rọ́nšα",AIS#1208#1#5#Ems-Domat,"il burro rancido",C159_v8_192,"BUTTER, RANZIG",,A60127_v8_192,Domat/Ems,"POLYGON((9.40448760986328 46.8009719848633,9.49982357025146 46.8009719848633,9.49982357025146 46.8501815795899,9.40448760986328 46.8501815795899,9.40448760986328 46.8009719848633))",7285659,1928-1940,,rom,L1389_v4_192,"pischada rontscha",L,roa,VA,sub,,f,168,rancĭdus,lat,0
G550_v5_192,"ɑnsɑlˈaː il kɑʃ͉ˈiɑl",2,"αnsαlā́ il kαš̩íαl",AIS#1217#1#5#Ems-Domat,"salare il formaggio",C864_v8_192,"DEN KÄSE SALZEN",,A60127_v8_192,Domat/Ems,"POLYGON((9.40448760986328 46.8009719848633,9.49982357025146 46.8009719848633,9.49982357025146 46.8501815795899,9.40448760986328 46.8501815795899,9.40448760986328 46.8009719848633))",7285659,1928-1940,,rom,L1403_v5_192,"ensalar il caschiel",L,roa,VA,v,,,57,caseu(m),lat,0
G550_v5_192,"ɑnsɑlˈaː il kɑʃ͉ˈiɑl",2,"αnsαlā́ il kαš̩íαl",AIS#1217#1#5#Ems-Domat,"salare il formaggio",C864_v8_192,"DEN KÄSE SALZEN",,A60127_v8_192,Domat/Ems,"POLYGON((9.40448760986328 46.8009719848633,9.49982357025146 46.8009719848633,9.49982357025146 46.8501815795899,9.40448760986328 46.8501815795899,9.40448760986328 46.8009719848633))",7285659,1928-1940,,rom,L1403_v5_192,"ensalar il caschiel",L,roa,VA,v,,,815,salis,lat,0
G687_v4_192,"lˌat̆ pɑnˈaʎɑ",2,"làᵗ pαnáłα",AIS#1208#2#5#Ems-Domat,"il siero di burro",C160_v8_192,"BUTTERMILCH (FLÜSSIGKEIT, DIE BEI DER PRODUKTION VON BUTTER ENTSTEHT)",Q106612,A60127_v8_192,Domat/Ems,"POLYGON((9.40448760986328 46.8009719848633,9.49982357025146 46.8009719848633,9.49982357025146 46.8501815795899,9.40448760986328 46.8501815795899,9.40448760986328 46.8009719848633))",7285659,1928-1940,,rom,L1450_v6_192,"latte panaglia",L,roa,VA,sub,,,119,lăcte(m),lat,0
G687_v4_192,"lˌat̆ pɑnˈaʎɑ",2,"làᵗ pαnáłα",AIS#1208#2#5#Ems-Domat,"il siero di burro",C160_v8_192,"BUTTERMILCH (FLÜSSIGKEIT, DIE BEI DER PRODUKTION VON BUTTER ENTSTEHT)",Q106612,A60127_v8_192,Domat/Ems,"POLYGON((9.40448760986328 46.8009719848633,9.49982357025146 46.8009719848633,9.49982357025146 46.8501815795899,9.40448760986328 46.8501815795899,9.40448760986328 46.8009719848633))",7285659,1928-1940,,rom,L1450_v6_192,"latte panaglia",L,roa,VA,sub,,,187,PĂNNUM,lat,0
G688_v4_192,"lˌaj̆t̆ pɑnˈaʎɑ",2,"làʸᵗ pαnáłα",AIS#1208#2#5#Ems-Domat,"il siero di burro",C160_v8_192,"BUTTERMILCH (FLÜSSIGKEIT, DIE BEI DER PRODUKTION VON BUTTER ENTSTEHT)",Q106612,A60127_v8_192,Domat/Ems,"POLYGON((9.40448760986328 46.8009719848633,9.49982357025146 46.8009719848633,9.49982357025146 46.8501815795899,9.40448760986328 46.8501815795899,9.40448760986328 46.8009719848633))",7285659,1928-1940,,rom,L1450_v6_192,"latte panaglia",L,roa,VA,sub,,,119,lăcte(m),lat,0
G688_v4_192,"lˌaj̆t̆ pɑnˈaʎɑ",2,"làʸᵗ pαnáłα",AIS#1208#2#5#Ems-Domat,"il siero di burro",C160_v8_192,"BUTTERMILCH (FLÜSSIGKEIT, DIE BEI DER PRODUKTION VON BUTTER ENTSTEHT)",Q106612,A60127_v8_192,Domat/Ems,"POLYGON((9.40448760986328 46.8009719848633,9.49982357025146 46.8009719848633,9.49982357025146 46.8501815795899,9.40448760986328 46.8501815795899,9.40448760986328 46.8009719848633))",7285659,1928-1940,,rom,L1450_v6_192,"latte panaglia",L,roa,VA,sub,,,187,PĂNNUM,lat,0
G7055_v3_192,"muntɑnˈɛːrɑ nˈʊrʃɑs͉",2,"muntαnḗ̜rα nú̜ršαs̩",AIS#1072#1#5#Ems-Domat,"il branco di pecore",C451_v8_192,"SCHAFHERDE (GRUPPE VON SCHAFEN)",,A60127_v8_192,Domat/Ems,"POLYGON((9.40448760986328 46.8009719848633,9.49982357025146 46.8009719848633,9.49982357025146 46.8501815795899,9.40448760986328 46.8501815795899,9.40448760986328 46.8009719848633))",7285659,1928-1940,,rom,,,,,,,,,,,,
G7239_v4_192,"ʃkɑrgˈaː dɑd ˈalp",2,"škαrgā́ dαd álp",AIS#1193a#1#5#Ems-Domat,"disalpare (N)",C10_v8_192,"DIE ALM VERLASSEN",Q59654931,A60127_v8_192,Domat/Ems,"POLYGON((9.40448760986328 46.8009719848633,9.49982357025146 46.8009719848633,9.49982357025146 46.8501815795899,9.40448760986328 46.8501815795899,9.40448760986328 46.8009719848633))",7285659,1928-1940,,rom,,,,,,,,,,,,
G7321_v3_192,"muntɑnˈeːʀɑ vˈakas͉",2,"muntαnẹ̄́ȓα vákas̩",AIS#1189#1#5#Ems-Domat,"una mandra di vacche",C217_v7_192,"KUHHERDE (GRUPPE VON KÜHEN)",,A60127_v8_192,Domat/Ems,"POLYGON((9.40448760986328 46.8009719848633,9.49982357025146 46.8009719848633,9.49982357025146 46.8501815795899,9.40448760986328 46.8501815795899,9.40448760986328 46.8009719848633))",7285659,1928-1940,,rom,,,,,,,,,,,,
G7322_v3_192,"mˈuːvɑl vˈakɑs͉",2,"mū́vαl vákαs̩",AIS#1189#1#5#Ems-Domat,"una mandra di vacche",C217_v7_192,"KUHHERDE (GRUPPE VON KÜHEN)",,A60127_v8_192,Domat/Ems,"POLYGON((9.40448760986328 46.8009719848633,9.49982357025146 46.8009719848633,9.49982357025146 46.8501815795899,9.40448760986328 46.8501815795899,9.40448760986328 46.8009719848633))",7285659,1928-1940,,rom,,,,,,,,,,,,
G7412_v4_192,"kulˈaː il lˈaʨ",2,"kulā́ il <span style=""position : relative"">lá<span style=""position: relative"">c<span style='position: absolute; width: 1em; font-size: 20%; top: 10%; left: calc(50% - 0.3em); font-weight: 900'><svg viewBox='0 0 100 100' style='display: inline-block; vertical-align: text-bottom'> <g transform='translate(0,-197)'> <path style='opacity:1;fill:#000000;fill-opacity:1;stroke:none;stroke-width:0.26458332' d='m 62.523311,202.6864 31.790967,-0.13364 -33.67596,93.63268 -6.533997,-1e-5 z' /> <path style='opacity:1;fill:#000000;fill-opacity:1;stroke:none;stroke-width:0.27790391' d='m 6.1724299,205.2214 c 2.8820995,-3.5226 9.4948791,-6.54795 16.1445731,-2.03301 46.526871,34.55507 33.752055,62.80626 0.935444,90.3371 C 17.826138,298.07355 9.918232,290.57481 7.1173704,287.74514 39.280556,261.75031 39.571048,235.98616 6.1724299,205.2214 Z'/> </g></svg></span></span></span>",AIS#1201#1#5#Ems-Domat,"colare il latte",C118_v8_192,"MILCH SEIHEN (MILCH FILTERN)",,A60127_v8_192,Domat/Ems,"POLYGON((9.40448760986328 46.8009719848633,9.49982357025146 46.8009719848633,9.49982357025146 46.8501815795899,9.40448760986328 46.8501815795899,9.40448760986328 46.8009719848633))",7285659,1928-1940,,rom,L1370_v8_192,"couler le lait / colare il latte",L,roa,VA,v,,,119,lăcte(m),lat,0
G7412_v4_192,"kulˈaː il lˈaʨ",2,"kulā́ il <span style=""position : relative"">lá<span style=""position: relative"">c<span style='position: absolute; width: 1em; font-size: 20%; top: 10%; left: calc(50% - 0.3em); font-weight: 900'><svg viewBox='0 0 100 100' style='display: inline-block; vertical-align: text-bottom'> <g transform='translate(0,-197)'> <path style='opacity:1;fill:#000000;fill-opacity:1;stroke:none;stroke-width:0.26458332' d='m 62.523311,202.6864 31.790967,-0.13364 -33.67596,93.63268 -6.533997,-1e-5 z' /> <path style='opacity:1;fill:#000000;fill-opacity:1;stroke:none;stroke-width:0.27790391' d='m 6.1724299,205.2214 c 2.8820995,-3.5226 9.4948791,-6.54795 16.1445731,-2.03301 46.526871,34.55507 33.752055,62.80626 0.935444,90.3371 C 17.826138,298.07355 9.918232,290.57481 7.1173704,287.74514 39.280556,261.75031 39.571048,235.98616 6.1724299,205.2214 Z'/> </g></svg></span></span></span>",AIS#1201#1#5#Ems-Domat,"colare il latte",C118_v8_192,"MILCH SEIHEN (MILCH FILTERN)",,A60127_v8_192,Domat/Ems,"POLYGON((9.40448760986328 46.8009719848633,9.49982357025146 46.8009719848633,9.49982357025146 46.8501815795899,9.40448760986328 46.8501815795899,9.40448760986328 46.8009719848633))",7285659,1928-1940,,rom,L1370_v8_192,"couler le lait / colare il latte",L,roa,VA,v,,,164,colare,lat,0
G7580_v3_192,"sˈuʨɑ dɑ mˈʊlʒɑr",2,"súc͗́α dα mú̜lžαr",AIS#1196#1#5#Ems-Domat,"lo 'scanno' da mungere (ill.)",C102_v7_192,MELKSTUHL,,A60127_v8_192,Domat/Ems,"POLYGON((9.40448760986328 46.8009719848633,9.49982357025146 46.8009719848633,9.49982357025146 46.8501815795899,9.40448760986328 46.8501815795899,9.40448760986328 46.8009719848633))",7285659,1928-1940,,rom,,,,,,,,,,,,
G7878_v3_192,"lˈaʨ s ɑŋkwˈaʟɑ",2,"<span style=""position : relative"">lá<span style=""position: relative"">c<span style='position: absolute; width: 1em; font-size: 20%; top: 10%; left: calc(50% - 0.3em); font-weight: 900'><svg viewBox='0 0 100 100' style='display: inline-block; vertical-align: text-bottom'> <g transform='translate(0,-197)'> <path style='opacity:1;fill:#000000;fill-opacity:1;stroke:none;stroke-width:0.26458332' d='m 62.523311,202.6864 31.790967,-0.13364 -33.67596,93.63268 -6.533997,-1e-5 z' /> <path style='opacity:1;fill:#000000;fill-opacity:1;stroke:none;stroke-width:0.27790391' d='m 6.1724299,205.2214 c 2.8820995,-3.5226 9.4948791,-6.54795 16.1445731,-2.03301 46.526871,34.55507 33.752055,62.80626 0.935444,90.3371 C 17.826138,298.07355 9.918232,290.57481 7.1173704,287.74514 39.280556,261.75031 39.571048,235.98616 6.1724299,205.2214 Z'/> </g></svg></span></span></span> s αɳkwáɫα",AIS#1214#1#5#Ems-Domat,"il latte caglia",C1240_v5_192,"DIE MILCH GERINNT",,A60127_v8_192,Domat/Ems,"POLYGON((9.40448760986328 46.8009719848633,9.49982357025146 46.8009719848633,9.49982357025146 46.8501815795899,9.40448760986328 46.8501815795899,9.40448760986328 46.8009719848633))",7285659,1928-1940,,rom,,,,,,,,,,,,
G7980_v3_192,"brˈiɑg dɑ pˈewŋ",2,"bríαg dα pẹ́wɳ",AIS#970#1#5#Ems-Domat,"il vaso per lo strutto (ill.)",C1292_v4_192,"GEFÄSS FÜR SCHMALZ, AUS HOLZ",,A60127_v8_192,Domat/Ems,"POLYGON((9.40448760986328 46.8009719848633,9.49982357025146 46.8009719848633,9.49982357025146 46.8501815795899,9.40448760986328 46.8501815795899,9.40448760986328 46.8009719848633))",7285659,1928-1940,,rom,,,,,,,,,,,,
G8330_v4_192,"sɑdˈɛlɑ dɑ mˈʊlʒɑr",2,"sαdé̜lα dα mú̜lžαr",AIS#1197#1#5#Ems-Domat,"il secchio da mungere (ill.)",C1268_v5_192,"GEFÄSS ZUM MELKEN",,A60127_v8_192,Domat/Ems,"POLYGON((9.40448760986328 46.8009719848633,9.49982357025146 46.8009719848633,9.49982357025146 46.8501815795899,9.40448760986328 46.8501815795899,9.40448760986328 46.8009719848633))",7285659,1928-1940,,rom,L5472_v3_192,"sedela da mungere",L,roa,VA,sub,,,76,mŭlgēre,lat,0
G8330_v4_192,"sɑdˈɛlɑ dɑ mˈʊlʒɑr",2,"sαdé̜lα dα mú̜lžαr",AIS#1197#1#5#Ems-Domat,"il secchio da mungere (ill.)",C1268_v5_192,"GEFÄSS ZUM MELKEN",,A60127_v8_192,Domat/Ems,"POLYGON((9.40448760986328 46.8009719848633,9.49982357025146 46.8009719848633,9.49982357025146 46.8501815795899,9.40448760986328 46.8501815795899,9.40448760986328 46.8009719848633))",7285659,1928-1940,,rom,L5472_v3_192,"sedela da mungere",L,roa,VA,sub,,,434,sĭtĕlla,lat,0
G9246_v2_192,"pre̜nd ọ̄́ lα mαñú̜kα",3,"pre̜nd ọ̄́ lα mαñú̜kα",AIS#1215#2#5#Ems-Domat,"il cacio fresco ",C226_v8_192,"QUARK (PRODUKT, FEST, NACH ERHITZUNG UND GERINNUNG DER MILCH)",Q259642,A60127_v8_192,Domat/Ems,"POLYGON((9.40448760986328 46.8009719848633,9.49982357025146 46.8009719848633,9.49982357025146 46.8501815795899,9.40448760986328 46.8501815795899,9.40448760986328 46.8009719848633))",7285659,1928-1940,,rom,,,,,,,,,,,,
G9847_v3_192,,4,,SDS#VII_245#2#GR16#Felsberg,"die einfache Lagerstätte für das Alppersonal",C674_v7_192,"SCHLAFRAUM ÜBER STUBE",,A60127_v8_192,Domat/Ems,"POLYGON((9.40448760986328 46.8009719848633,9.49982357025146 46.8009719848633,9.49982357025146 46.8501815795899,9.40448760986328 46.8501815795899,9.40448760986328 46.8009719848633))",7285659,1962-2003,,ger,,"ufem Stäli",L,gem,SDS,,,,,,,